{"text_format":"1","workbook":"xlsx","n_sheets":4,"sheets":["RiskSerializationData","rsklibSimData","Distributions","Sheet2"],"not_rendered":{"charts":0,"images":0,"macros":1,"external_links":1,"defined_names":1,"comments":0,"pivot_tables":0},"unopened":[],"bounds":{"document_bytes":16777216,"sheet_cells":100000,"rows_first":2000,"rows_last":500,"rows_between":2000,"halvings":0,"cell_chars":16384,"cell_head_chars":4096},"cells_cut":1,"cells_raw":0,"read":"whole","date_system":"1900"}

{"sheet":"RiskSerializationData","index":0,"n_rows":11,"n_cols":48,"rows_kept":11,"cut":false,"hidden":true,"merged":[]}
[1,0]
[0]
[{"$f":"[1]Distribution!$D$690","v":4.3459000000000003},false,1,1,"GF1_rK0qDwEADgAKAQwjACYAOwBqAH4AfwCiALAA5AAGAQABKgD//wAAAAAAAQQAAAAAB0dlbmVyYWwAAAABBE1UQkYBJUNvbXBhcmlzb24gd2l0aCBMb2dub3JtKDQuMzQ1OSw2LjMzOCkBARAAAgABClN0YXRpc3RpY3MDAQEA/wEBAQEBAAEAAAAAAAAANMAAAAAAAMBWQAEHAAAAAQAEAAAAAQEBAQEAAQEBAAQAAAACtwACxgAACwAETVRCRgAALwECAAIAHAAVTG9nbm9ybSg0LjM0NTksNi4zMzgpAQElAQIA7AD2AAEBAgGamZmZmZm5PwAAzczMzMzM7D8AAAUAAQEBAAEBAQA=",2,0,0,null,null,null,null,null,null,null,null,null,null,null,null,null,null,null,null,null,null,null,null,null,null,null,null,{"$f":"[1]Distribution!$D$690","v":4.3459000000000003},4,1,false,false,1,false,{"$f":"_","v":{"$error":"#NAME?"}},{"$f":"[1]Distribution!$D$690","v":4.3459000000000003},4,1,true,false,1,false,{"$f":"_RiskLognorm(4.3459,6.338,_xll.RiskName(\"MTBF\"))","v":{"$error":"#NAME?"}}]
[0]
[false,15680,7345,13120,100]
[false,15680,7345,13120,500]
[false,15680,7345,13120,1000]
[false,15680,7345,13120,1500]
[false,15680,7345,13120,2000]
[0]
[0,false,false,10,0.95,1]

{"sheet":"rsklibSimData","index":1,"n_rows":1,"n_cols":3,"rows_kept":1,"cut":false,"hidden":true,"merged":[]}
["a0d67d88f881f2f24c7991865205ec050|1|35888|e17ec16be5c331e280d89bd67f004103",{"$cut":{"chars":64680,"head":"3c5104437340698bc49378f0b8cfbbff_x0004__x0005_ÐÏ_x0011_à¡±_x001A_á_x0004__x0004__x0004__x0004__x0004__x0004__x0004__x0004__x0004__x0004__x0004__x0004__x0004__x0004__x0004__x0004_>_x0004__x0003__x0004_þÿ\t_x0004__x0006__x0004__x0004__x0004__x0004__x0004__x0004__x0004__x0004__x0004__x0004__x0004__x0001__x0004__x0004__x0004__x0001__x0004__x0004__x0004__x0004__x0004__x0004__x0004__x0004__x0010__x0004__x0004__x0002__x0004__x0004__x0004__x0001__x0004__x0004__x0004_þÿÿÿ_x0004__x0004__x0004__x0004__x0004__x0004__x0004__x0004_ÿÿÿÿÿÿÿÿÿÿÿÿÿÿÿÿÿÿÿÿÿÿÿÿÿÿÿÿÿÿÿÿÿÿÿÿÿÿÿÿÿÿÿÿÿÿÿÿÿÿÿÿÿÿÿÿÿÿÿÿÿÿÿÿÿÿÿÿÿÿÿÿÿÿÿÿÿÿÿÿÿÿÿÿÿÿÿÿÿÿÿÿÿÿÿÿÿÿÿÿÿÿÿÿÿÿÿÿÿÿÿÿÿÿÿÿÿÿÿÿÿÿÿÿÿÿÿÿÿÿÿÿÿÿÿÿÿÿÿÿÿÿÿÿÿÿÿÿÿÿÿÿÿÿÿÿÿÿÿÿÿÿÿÿÿÿÿÿÿÿÿÿ_x0001__x0002_ÿÿÿÿÿÿÿÿÿÿÿÿÿÿÿÿÿÿÿÿÿÿÿÿÿÿÿÿÿÿÿÿÿÿÿÿÿÿÿÿÿÿÿÿÿÿÿÿÿÿÿÿÿÿÿÿÿÿÿÿÿÿÿÿÿÿÿÿÿÿÿÿÿÿÿÿÿÿÿÿÿÿÿÿÿÿÿÿÿÿÿÿÿÿÿÿÿÿÿÿÿÿÿÿÿÿÿÿÿÿÿÿÿÿÿÿÿÿÿÿÿÿÿÿÿÿÿÿÿÿÿÿÿÿÿÿÿÿÿÿÿÿÿÿÿÿÿÿÿÿÿÿÿÿÿÿÿÿÿÿÿÿÿÿÿÿÿÿÿÿÿÿÿÿÿÿÿÿÿÿÿÿÿÿÿÿÿÿÿÿÿÿÿÿÿÿÿÿÿÿÿÿÿÿÿÿÿÿÿÿÿÿÿÿÿÿÿÿÿÿÿÿÿÿÿÿÿÿÿÿÿÿÿÿÿÿÿÿÿÿÿÿÿÿÿÿÿÿÿÿÿÿ_x0001__x0002_ÿÿÿÿÿÿÿÿýÿÿÿþÿÿÿþÿÿÿ_x0014__x0001__x0001__x0001__x0005__x0001__x0001__x0001__x0006__x0001__x0001__x0001__x0007__x0001__x0001__x0001__x0008__x0001__x0001__x0001_\t_x0001__x0001__x0001__x0002__x0001__x0001__x0001__x000B__x0001__x0001__x0001__x000C__x0001__x0001__x0001__x000D__x0001__x0001__x0001__x000E__x0001__x0001__x0001__x000F__x0001__x0001__x0001__x0010__x0001__x0001__x0001__x0011__x0001__x0001__x0001__x0012__x0001__x0001__x0001__x0013__x0001__x0001__x0001__x0003__x0001__x0001__x0001__x0015__x0001__x0001__x0001__x0016__x0001__x0001__x0001__x0017__x0001__x0001__x0001__x0018__x0001__x0001__x0001__x0019__x0001__x0001__x0001__x001A__x0001__x0001__x0001__x001B__x0001__x0001__x0001__x001C__x0001__x0001__x0001__x001D__x0001__x0001__x0001__x001E__x0001__x0001__x0001__x001F__x0001__x0001__x0001_ _x0001__x0001__x0001_!_x0001__x0001__x0001_\"_x0001__x0001__x0001_#_x0001__x0001__x0001_$_x0001__x0001__x0001_%_x0001__x0001__x0001_&_x0001__x0001__x0001_'_x0001__x0001__x0001_(_x0001__x0001__x0001_)_x0001__x0001__x0001_*_x0001__x0001__x0001_+_x0001__x0001__x0001_,_x0001__x0001__x0001_-_x0001__x0001__x0001_._x0001__x0001__x0001_/_x0001__x0001__x0001_0_x0001__x0001__x0001_1_x0001__x0001__x0001_2_x0001__x0001__x0001_3_x0001__x0001__x0001_4_x0001__x0001__x0001_5_x0001__x0001__x0001_6_x0001__x0001__x0001_7_x0001__x0001__x0001_8_x0001__x0001__x0001_9_x0001__x0001__x0001_:_x0001__x0001__x0001_;_x0001__x0001__x0001_<_x0001__x0001__x0001_=_x0001__x0001__x0001__x0001__x0002_>_x0001__x0001__x0001_?_x0001__x0001__x0001_@_x0001__x0001__x0001_A_x0001__x0001__x0001_B_x0001__x0001__x0001_C_x0001__x0001__x0001_D_x0001__x0001__x0001_E_x0001__x0001__x0001_þÿÿÿÿÿÿÿÿÿÿÿÿÿÿÿÿÿÿÿÿÿÿÿÿÿÿÿÿÿÿÿÿÿÿÿÿÿÿÿÿÿÿÿÿÿÿÿÿÿÿÿÿÿÿÿÿÿÿÿÿÿÿÿÿÿÿÿÿÿÿÿÿÿÿÿÿÿÿÿÿÿÿÿÿÿÿÿÿÿÿÿÿÿÿÿÿÿÿÿÿÿÿÿÿÿÿÿÿÿÿÿÿÿÿÿÿÿÿÿÿÿÿÿÿÿÿÿÿÿÿÿÿÿÿÿÿÿÿÿÿÿÿÿÿÿÿÿÿÿÿÿÿÿÿÿÿÿÿÿÿÿÿÿÿÿÿÿÿÿÿÿÿÿÿÿÿÿÿÿÿÿÿÿÿÿÿÿÿÿÿÿÿÿÿÿÿÿÿÿÿÿÿÿÿÿÿÿÿÿÿÿÿÿÿÿÿÿÿÿ_x0003__x0004_ÿÿÿÿÿÿÿÿÿÿÿÿÿÿÿÿR_x0003_o_x0003_o_x0003_t_x0003_ _x0003_E_x0003_n_x0003_t_x0003_r_x0003_y_x0003__x0003__x0003__x0003__x0003__x0003__x0003__x0003__x0003__x0003__x0003__x0003__x0003__x0003__x0003__x0003__x0003__x0003__x0003__x0003__x0003__x0003__x0003__x0003__x0003__x0003__x0003__x0003__x0003__x0003__x0003__x0003__x0003__x0003__x0003__x0003__x0003__x0003__x0003__x0003__x0003__x0003__x0003__x0003__x0003__x0016__x0003__x0005__x0003_ÿÿÿÿÿÿÿÿ_x0001__x0003__x0003__x0003__x0003__x0003__x0003__x0003__x0003__x0003__x0003__x0003__x0003__x0003__x0003__x0003__x0003__x0003__x0003__x0003__x0003__x0003__x0003__x0003__x0003__x0003__x0003__x0003__x0003__x0003__x0003__x0003_0\u009dÍ2Ä´Ð_x0001_þÿÿÿ_x0003__x0003__x0003__x0003__x0003__x0003__x0003__x0003_R_x0003_S_x0003_K_x0003_L_x0003_I_x0003_B_x0003_ _x0003_D_x0003_a_x0003_t_x0003_a_x0003__x0003__x0003__x0003__x0003__x0003__x0003__x0003__x0003__x0003__x0003__x0003__x0003__x0003__x0003__x0003__x0003__x0003__x0003__x0003__x0003__x0003__x0003__x0003__x0003__x0003__x0003__x0003__x0003__x0003__x0003__x0003__x0003__x0003__x0003__x0003__x0003__x0003__x0003__x0003__x0003__x0003__x0003__x0018__x0003__x0002__x0001_ÿÿÿÿÿÿÿÿÿÿÿÿ_x0003__x0003__x0003__x0003__x0003__x0003__x0003__x0003__x0003__x0003__x0003__x0"}},"b27da5465c9aa35e358f34d82da62934\u0002\u0007ÒÆ\u0002ôbSô?Ç\u001fÒ¤¶þë?ù\u0091)\u0080ÂX&@\u008ar\u001e\u0018óXé?Íxñl7e\u0012@§Ï\"ê\u009e1\u0001@\u001b[d\u009d¨[\"@¥Íz]\u0093i\b@\u001a\u0017>\u009dI\u008cþ?\u0080k\u009aÍ\u009bÎ\u0016@\u007f7\u0010Sáñ\u0006@)y\u001d\u00841?ö?àÃ\u0093îd\u0002ß?b&\u0080\u001dlÛ\u001d@\u008fç U\u0084\u0011\u0003@9ç½ð7\u0005ã?\"!p³Ö\u0018ð?aªíºÏñá?{ ^-òãÛ?iitïG¿ü?úº½8«ië?\u0019(Ì\u0091<©(@È¤\u009d\u008c\u0012Tã?ËE\u009dR^O\u001f@à\u0006¶O\f\u0016'@åí0\u001f\u009acþ?Ó\"@Ä60\u0002@!\u0016Q\u008bgÁí?\u008b\u0099Ý\u001däÑ\u000f@\u0004õ\u0016¥\u0094.ï?Y=\u0004a\u0090òñ?\u001f\u009f\u001ff\u0001\u00020Ñ÷?â6(\u000fÉ\u00810@\u009fªXÏ£T\u0001@§³MP?\u0016\u0012@ãm®aU¼-@õ\u0090\täh_â?\u009e:\u0002\u000b\\ù7@\u0099\u0096eÉ4\u0084\"@©JÂDOg\u0019@^Ì\u001cÒÐÕ!@ï+¾ge\u0087\u0010@î,gÓÜ·\u0010@(Ç?Ù\u001bþò?¶\u0081\u0088P\u009bu\u0006@\u009c·ô_2§ÿ?\u0017H'`eÏ9@\u0016ßÞ\u009b+\u0080#@\u0001`\u000fW¥Ð\u000e@D\u0087ê N\u0011ó?vr\u009aeÞ\u0089É?ÛKÓ`õ8\u0001@Å ÏV\u000eú\u0012@ÿéé^®ã\u0003@\u008d¡`º\u008dõ0@\u0018æ+ê25ò?ÜØ¡\u0090\u0091éò?È\u0017ÅÝá\u0096$@ªÒ\u009aûð6Ù?S¤\u0004Ç.´÷?\u008eÈ\u008dij¥/@ÉÇ¼FÆ\u001e\u0006@µªÕçúá\u000f@\u0005\u0007%rIm¦g\r@ ñîõ~Fé?6*L\u008f¾Á1@\u0087Pé§öÇ#@Å<\u0096\u0018ÏËô?\u0015\u0002£Rc\u0096ô?ki9`gÈþ?z>ñI:\u009bó?f\u0007<#*¦\u0003@\t¡\u001a\u008eÍ\u009dï?m(¢]D\u001cö?\u007f\t\u0095æ×â\u0011@jmfãBÞ @w:\u0082áä)ó?Éù:c\u0080\u0098\u0007@ÌËlÀÛ(í?\u009eÍÏ\u008a`µá?*\u00187­Æv\u0011@½QÂm`Jì?Í\u0016ÕIÚ;\u000f@5»æÄ\u0088\u009c\u0019@\u0004\u009dLU\u001b\u009a\u0001@\u009a)Z*L¶\u0005@\u0010\u009e\u009ewÆÂø?\u001cXÉ\u0084P;ú?ø|ØÈ~|Ý?¹CfXG\u009c\u001c@{¥p¤¿²\u0006@\u0006Ñ\u008aòik\u0010@\u0082*ñ£Ð\u008bé?\u0088èÁ\u0092,ï\u0001@t\u009b\u0097b\u0003\u0007Máë?\u001eæns\u008fá'@\\¢Ù¡ºCà?\u008fY\u001aç5R\u0019@CoàYkÄ\u0006@%Å0Ò=¥\r@Î\u0086çøÓò\u001f@\u0006ì­¿\u0099Ví?WÑüð\u001bW2@»\u008bhNé#õ?üý!PµÎá?fó\u007f\u0080ÍD\u0002@\u008a\u0081uÉr«Â?áA»È\u0018\u0007ï?ú¡\u0080j\u0016ãí?`¿òÄÚ¯\u000b@· Ò\u00912¨\u0013@Ì.\u0082\u008c/Ù\u0003@QÚUä}.!@8Ø\brðø3@¤³¼Nã\u001f\u0006@8\u008c_2\u009e¹%@yi¢°6M\u0012@*ÜáÃó'î?÷ VÚg7\u0012@'\u000e\u001d\u008fªvú?\u0005bWÀ\u0081Í&@\u0004Ä\u0014_\u009ezô?Æ\u0090\u00112åöï?Abô¡\u009f\u0018ü?\u0001oíFp3ð?Uò\u008d\u0014r ú?\u0001\u0002ë#ÌÑÄÚõ?]\u0098i5cXè?¹\u0097\u0092\u0011+Cç?\u0014còÖ¢E\u0014@4\u001e\u001bw\u0080æ\u001a@¢¨\u000b\u001e\u0011íê?Eó\u001av¥°ö?&0\u0080ÁR{\u0017@:\fª#Ç\u0016\u0015@üÿFÎ\u0089\u008d\u0015@ºÒÊ{Ë\u001fã?]>hCñÒï?\u001cÓ>\u007f\u0006i1@Ê\u0083¨\u009aÂ3õ?±\u001a\u0016Ì\u0016oØ?µ\u009b\u0007\u0093\u0094Ì\t@\u0092a\u008fp½\u001bë?ÏÉôßi½\u0004@4\u001866\u0018\u0098ý?\u0011Gü\u0081\u0010NÐ?°\u0012¡ë\u0092%F@,\u008e3\u0019Ë\u008bÐ?ýÔñ\u0097¤Öù?È\u0092µÒ\u009d\u0093õ?§_a\r\u009b®ò?\u0015É½<ø\u009fá?½\u001a<SóLè?[z¬#£\u0011\u0013@á»$\u0089ª¶ß?Zq¡\u0094`+Õ?./\u008dEz\u0004\u0018@M)\u0095-\u0002\u0003Ü<Û?·\u0084\u0005ëõÒð?Oê%­\u0085áð?ÇAOpv®\u0014@sç{Ô\u0003\u008d\u0001@\u0015\u0015IÝÀ|\u0013@x\u009díâ\u0002ï#@\u0012e\u0080\u000e=Ññ?«[\u009eÊ]\r\u0002@\u0004\u001arºG\u0018Í?8°\u0099\u001f\u001aÑû?\rã\f-.³â?J2'@Çzñ?\u008c:\u008f\u009a¶ãì?x ñú\u008bS6@i_­Û\u0084=.@n\u0082ø\u0085oN\u0018@\u009bn¹\u000e(±è?!\u0099JñÔ»\t@\u0098x³Î7Íè?\u0001&\u0080\u009a\u0097i\u0013@³\u0083\u0091\\¸,ô?w\u0088¢\u007f«b!@´ýbG!\u0095\u0004@u£\u0003ÁþÉ\u0001@ùuW\u0084\u0003\u000b\b@\u0099ÐK\u009då¨\b@G=\u009b\u0081héî?\u00028½r;\u0010\u001a@\u0002XXyÞ-,@\u0088\rú\u008bTcÖ?Ú\u0019\u0012·¸Y%@\u0001\u000b^©¹Í«4ó?äþ)\u009c~]\u0014@é'.î\u0019Å\u000e@\u0083u®eÏqð?h.3ðlGá?^EkÁVäç?ÁLÐc\u008a_\u0013@>\u0002±\u0002\u000b¾ò?ê\u009eMh\u0081Ïê?Eì\u0005h\u0019ª @Íó\u0090Úvøð?,Î{êt(\u0017@Íáò?\u0087\u0006ý?­´\t> ×\u0018@ßeÜi\u001a\u0081C@N>\u0007«Üv\u000b@=\u0010\u001anyÍ\u001c@\u0017Ýõ¹Ø\u0083ä?>Zê»Ð}\u0003@ËËÏªÖHå?I¹\u001adº;\u0004@²d¬ÍÕÄÿ?A;ÁÎYØ\u0007@øÏëe§è\u001d@¬Ö\u0080\u0083\u0001Æç?îØ\u008bâè°\u0013@\u0095~\u001b\u007f>§\u0002@cêéØ&\bÒ?Oö^\u0095oî\u0017@rTÿ\u001e\u009cþð?\u000b(\u0017åó¥\u001e@h&\u0006ð\u0004\u0005+þè?\tðµ¨G\u008b\u001d@N»\u0098¼La\u001a@Ágîç\u008eÏü?Õ\u007f\u009fµiÔ×?©\u0019¦Ïõ\rê?ëö\b'\u007fô%@\u0092°\u0087Dý\u0081\t@Tý\u009bÁ\u0003_\u001d@Ð:\u0001\u0084º¢\u0016@i\u00192dXbø?û\u0012-JvÖÓ??·]@Bÿý?\u0002\u0004\u0004\u0004\u001f\u0004\u0004\u0004MASTER Scanner  01.07.2015.xlsx\u0007\u0004\u0004\u0004\u0005\u0004\u0004\u0004Scan Queue\u0004\u0004\u0004\u0004\u0007\u0004\u0004\u0004Scanner\u0004\u0004\u0004\u0004\t\u0004\u0004\u0004DELAY LOG\u0004\u0004\u0004\u0004\u0003\u0004\u0004\u0004ALL\u0004\u0004\u0004\u0004\u0007\u0004\u0004\u0004Summary\u0004\u0004\u0004\u0004\u0014\u0004\u0004\u0004_@RISKFitInformation\u0004\u0004\u0004\u0004\f\u0004\u0004\u0004D\u0002\u0003istribution\u0004\u0002\u0002\u0002\u0004\u0002\u0002\u0002A690)\u0002\u0002\u0002=RiskExpon(6.3642,RiskName(\"Q Arrivals\"))\u0002\u0002\u0002\u0002\u0001\u0002\u0002\u0002\u0002\u0002\u0002\u0002\u0002\u0002\u0002\u0002\u0001\u0002\u0002\u0002)\u0002\u0002\u0002\u0003\u0002\u0002\u0002Q Arrivals\u0002\u0002\u0002\u0002\u0002\u0002\u0002\u0002\u0002\u0002\u0002\u0002\u0002\u0002\u0002\u0002\u0002\u0002\u0002\u0002\u0004\u0002\u0002\u0002B690*\u0002\u0002\u0002=RiskExpon(4.247,RiskName(\"Process Time\"))\u0002\u0002\u0002\u0002\u0001\u0002\u0002\u0002\u0002\u0002\u0002\u0002\u0001\u0002\u0002\u0002\u0001\u0002\u0002\u0002*\u0002\u0002\u0002\f\u0002\u0002\u0002Process Time\u0002\u0002\u0002\u0002\u0002\u0002\u0002\u0002\u0002\u0002\u0002\u0002\u0002\u0002\u0002\u0002\u0002\u0002\u0002\u0002\u0004\u0002\u0002\u0002C690#\u0002\u0002\u0002\u0005\u0006=RiskExpon(2.1033,RiskName(\"MTTR\"))\u0005\u0005\u0005\u0005\u0001\u0005\u0005\u0005\u0005\u0005\u0005\u0005\u0002\u0005\u0005\u0005\u0001\u0005\u0005\u0005#\u0005\u0005\u0005\u0004\u0005\u0005\u0005MTTR\u0005\u0005\u0005\u0005\u0005\u0005\u0005\u0005\u0005\u0005\u0005\u0005\u0005\u0005\u0005\u0005\u0005\u0005\u0005\u0005\u0004\u0005\u0005\u0005D690+\u0005\u0005\u0005=RiskLognorm(4.3459,6.338,RiskName(\"MTBF\"))\u0005\u0005\u0005\u0005\u0001\u0005\u0005\u0005\u0005\u0005\u0005\u0005\u0003\u0005\u0005\u0005\u0001\u0005\u0005\u0005+\u0005\u0005\u0005\u0004\u0005\u0005\u0005MTBF\u0005\u0005\u0005\u0005\u0005\u0005\u0005\u0005\u0005\u0005\u0005\u0005\u0005\u0005\u0005\u0005\u0005\u0005\u0005\u0005\u001e\u0005\u0005\u0005DistributionsSimioTo@Risk.xlsx\u0003\u0005\u0005\u0005\r\u0005\u0005\u0005rsklibSimData\u0005\u0005\u0005\u0004\t\u0004\u0015\u0004\u0004\u0004RiskSerializationData\u0004\u0004\u0004\u0004\u0006\u0004\u0004\u0004Sheet1\u0004\u0004\u0004\u0004\u0004\u0004\u0004\u0004\u0001\u0004\u0004\u0004\u0005\u0004\u0004\u0004Sim#1\u0004\u0004\u0004\u0004\u0004\u0004\b\u0004\u0004\u0004CYZCVI1D\u0004\u0004\u0004\u0004\u0004\u0004\u009f\u0001\u0004\u0004R\u0004\u0004\u0004HI2RQN32MGAIFS2QIMADUG3C\u0004\u0004\u0004ÿÿÿÿ\u0004\u0004ÿÿÿÿ\u0004\u0004ÿÿÿÿ\u0004\u0004ÿÿÿÿ4N6K18KYSW7RBJRPZXQAWKET\u0004\u0010'\u0004\u0004a\u0003\u0004\u0004\u0004\u0002\u0004\u0004\u0010\u0002\u0004\u0004\u0004\u0004\u001f\u0004\u0004\u0080MASTER Scanner  01.07.2015.xlsx\u0018\u0004\u0004\u0004HI2RQN32MGAIFS2QIMADUG3C\u0007\u0004\u0004\u0004\u0005\u0006\u0005\u0006\u0005\u0005\u0080Scan Queue\u0005\u0005\u0005\u0005\u0005\u0007\u0005\u0005\u0080Scanner\u0005\u0005\u0005\u0005\u0005\t\u0005\u0005\u0080DELAY LOG\u0005\u0005\u0005\u0005\u0005\u0003\u0005\u0005\u0080ALL\u0005\u0005\u0005\u0005\u0005\u0007\u0005\u0005\u0080Summary\u0005\u0005\u0005\u0005\u0005\u0014\u0005\u0005\u0080_@RISKFitInformation\u0005\u0005\u0005\u0005\u0005\f\u0005\u0005\u0080Distribution\u0004\u0005\u0005\u0005\u0005±\u0002\u0005\u0005\u0005\u0005)\u0005\u0005\u0080=RiskExpon(6.3642,RiskName(\"Q Arrivals\"))\u0005\u0005\u0005\u0080\u0005\u0001\u0005\u0005\u0005\u0005\u0005\u0005\u0005\u0005\u0001\u0005\u0005\u0005)\u0005\u0005\u0005\u0006\u0005\u0005\u0080Q Arrivals\u0005\u0005ÿÿÿÿ\u0005\u0005\u0005\u0080\u0005\u0005\u0005\u0080\u0005\u0005\u0005\u0080\u0005\u0005\u0005\u0080\u0005\u0005\u0005\u0005\u0005±\u0002\u0005\u0005\u0001\u0005\u0005\u0006*\u0005\u0005\u0080=RiskExpon(4.247,RiskName(\"Process Time\"))\u0005\u0005\u0005\u0080\u0005\u0001\u0005\u0005\u0005\u0005\u0001\u0005\u0005\u0005\u0001\u0005\u0005\u0005*\u0005\u0005\u0005\f\u0005\u0005\u0080Process Time\u0005\u0005ÿÿÿÿ\u0005\u0005\u0005\u0080\u0005\u0005\u0005\u0080\u0005\u0005\u0005\u0080\u0005\u0005\u0005\u0080\u0005\u0005\u0005\u0005\u0005±\u0002\u0005\u0005\u0002\u0005#\u0005\u0005\u0080=RiskExpon(2.1033,RiskName(\"MTTR\"))\u0005\u0005\u0005\u0080\u0005\u0001\u0005\u0005\u0005\u0005\u0002\u0005\u0005\u0005\u0001\u0005\u0005\u0005#\u0005\u0005\u0005\u0004\u0005\u0005\u0080MTTR\u0005\u0005ÿÿÿÿ\u0005\u0005\u0005\u0080\u0005\u0005\u0005\u0080\u0005\u0005\u0005\u0080\u0005\u0005\u0005\u0080\u0005\u0005\u0005\u0005\u0005±\u0002\u0005\u0005\u0003\u0005+\u0005\u0005\u0080=RiskLognorm(4.3459,6.338,Ris\u0005\u0007kName(\"MTBF\"))\u0005\u0005\u0005\u0080\u0005\u0001\u0005\u0005\u0005\u0005\u0003\u0005\u0005\u0005\u0001\u0005\u0005\u0005+\u0005\u0005\u0005\u0004\u0005\u0005\u0080MTBF\u0005\u0005ÿÿÿÿ\u0005\u0005\u0005\u0080\u0005\u0005\u0005\u0080\u0005\u0005\u0005\u0080\u0005\u0005\u0005\u0080\u0005\u0005\u0005\u0005\u0005\u001e\u0005\u0005\u0080DistributionsSimioTo@Risk.xlsx\u0018\u0005\u0005\u00054N6K18KYSW7RBJRPZXQAWKET\u0003\u0005\u0005\u0005\u0005\r\u0005\u0005\u0080rsklibSimData\u0005\u0005\u0005\u0005\u0005\u0015\u0005\u0005\u0080RiskSerializationData\u0005\u0005\u0005\u0005\u0005\u0006\u0005\u0005\u0080Sheet1\u0005\u0005\u0005\u0005\u0004\u0005\u0005\u0005\u0005\u0005\u0005\u0005\u0005\u0005\u0005\u0005\u0005\u0005\u0005\u0005\u0004\u0005\u0005\u0005\u0005\u0005\u0006\u0005\u0005\u0005\u0005\u0005\u0005\u0005\u0005\u0005\u0006\u0005\u0001\u0005\u0005\u0005\u0005\u0005\u0005\u0005\u0006\u0005\u0002\u0005\u0005\u0005\u0002\u0004\u0002\u0002\u0002\u0002\u0006\u0002\u0003\u0002\u0002\u0002\u0002\u0002\u0002\u0002\u0002\u0002\u0002\u0002\u0002\u0002\u0002\u0002\u0002\u0002\u0012'\u0002\u0002,\u0002\u0002\u0002ÿÿÿÿÿÿÿÿÿÿÿÿÿÿÿÿÿÿÿÿÿÿÿÿÿÿÿÿÿÿÿÿ\u0002\u0002\u0002\u0002\u0011'\u0002\u0002\f\u0002\u0002\u0002\u0001\u0002\u0002\u0002\u0013'\u0002\u0002\u0010\u0002\u0002\u0002\u0001\u0002\u0002\u0002 g\u0094t\u009f\u0001\u0002\u0002ÿÿÿÿ"]

{"sheet":"Distributions","index":2,"n_rows":37,"n_cols":11,"rows_kept":37,"cut":false,"hidden":false,"merged":[]}
["Type","Simio",{"$f":"\"@Risk\"","v":"@Risk"},"Comments","Conversion Required",{"$f":"\"@Risk Distribution\"","v":"@Risk Distribution"},{"$f":"\"@Risk Distribution Formula\"","v":"@Risk Distribution Formula"},"Simio Conversion",null,"Tally",{"$f":"\"@Risk Value\"","v":"@Risk Value"}]
["Continuous","Random.Beta(alpha1, alpha2)","RiskBeta(a1,a2)",null,"No",{"$f":"_xll.RiskBeta(2,2)","v":0.5},{"$f":"ShowF(F2)","v":"=RiskBeta(2,2)"},{"$f":"ConvertToSimio(F2)","v":"Random.Beta(2,2)"},null,"D1",{"$f":"F2","v":0.5}]
["Discrete","Random.Binomial(ProbababilityOfSuccess, NumberTrials)","RiskBinomial(n,p)",null,"Yes",{"$f":"_xll.RiskBinomial(10,0.5)","v":5},{"$f":"ShowF(F3)","v":"=RiskBinomial(10,0.5)"},{"$f":"ConvertToSimio(F3)","v":"Random.Binomial(0.5,10)"},null,"D2",{"$f":"F3","v":5}]
["Continuous","Random.Continuous(v1, c1, v2, c2, …. ,vN, cN)","RiskCumul(min,max,{xi},{Pi})","Cumul(0,10,{1,4,6},{0.1,0.6,0.8})","Yes",{"$f":"_xll.RiskCumul(-1,1,{-0.5,0,0.5},{0.1,0.5,0.9})","v":0},"=RiskCumul(-1,1,{-0.5,0,0.5},{0.1,0.5,0.9})",{"$f":"ConvertToSimio(F4)","v":"Random.Continuous(-1,0,-0.5,0.1,0,0.5,0.5,0.9,1,1)"},null,"D3",0]
["Continuous",null,"RiskCumulD(min,max,{xi},Pi})","CumulD(0,10,{1,4,6},{0.8,0.6,0.1})","Yes",{"$f":"_xll.RiskCumulD(-1,1,{-0.5,0,0.5},{0.9,0.5,0.1})","v":0},"=RiskCumulD(-1,1,{-0.5,0,0.5},{0.9,0.5,0.1})",{"$f":"ConvertToSimio(F5)","v":"Please use Cumul not CumulD"},null,"D4",0]
["Discrete","Random.Discrete(v1, c1, v2, c2, …. ,vN, cN)","RiskDiscrete({xi},{pi})",null,"Yes",{"$f":"_xll.RiskDiscrete({-1,0,1},{0.3,0.4,0.3})","v":0},"=RiskDiscrete({-1,0,1},{0.3,0.4,0.3})",{"$f":"ConvertToSimio(F6)","v":"Random.Discrete(-1,0.3,0, .7,1, 1)"},null,"D5",0]
["Continuous","Random.Erlang(mean, K) ","RiskErlang(m,b)",null,"Yes",{"$f":"_xll.RiskErlang(2,10)","v":20},"=RiskErlang(2,10)",{"$f":"ConvertToSimio(F7)","v":"Random.Erlang( 20,2)"},null,"D6",20]
["Continuous","Random.Exponential(mean)","RiskExpon(b)",null,"No",{"$f":"_xll.RiskExpon(10)","v":10},"=RiskExpon(10)",{"$f":"ConvertToSimio(F8)","v":"Random.Exponential(10)"},null,"D7",10]
["Continuous","Random.Gamma(shape, scale)","RiskGamma(a,b)",null,"No",{"$f":"_xll.RiskGamma(2,10)","v":20},"=RiskGamma(2,10)","Random.Gamma(2,10)",null,"D8",20]
["Discrete","Random.Geometric(ProbabilityOfSuccess) ","RiskGeomet(p)",null,"No",{"$f":"_xll.RiskGeomet(0.5)","v":1},"=RiskGeomet(0.5)","Random.Geometric(0.5)",null,"D9",1]
["Continuous","Random.JohnsonSB(alpha1, alpha2, min, max)","JohnsonB(a1, a2, Min, Max)",null,"No",{"$f":"_xll.RiskJohnsonSB(2,2,-10,10)","v":-4.4116163049057722},"=RiskJohnsonSB(2,2,-10,10)","Random.JohnsonSB(2,2,-10,10)",null,"D10",-4.4116163049057722]
["Continuous","Random.JohnsonSU(alpha1, alpha2, location, scale)","JohnsonU(a1, a2, b, g)",null,"No",{"$f":"_xll.RiskJohnsonSU(-2,2,0,10)","v":13.316774146197615},"=RiskJohnsonSU(-2,2,0,10)",{"$f":"ConvertToSimio(F12)","v":"Random.JohnsonSU(-2,2,0,10)"},null,"D11",13.316774146197615]
["Continuous","Random.LogLogistic(shape, scale)","LogLogistic(a,b)",null,"Yes",{"$f":"_xll.RiskLoglogistic(0,10,3)","v":12.091995761561453},"=RiskLoglogistic(0,10,3)","Random.Loglogistic(3,10)",null,"D12",12.091995761561453]
["Continuous","Random.LogNormal(normalMean, normalStdDev)","RiskLognorm(m,s)",null,"Yes",{"$f":"_xll.RiskLognorm(15,10)","v":15},"=RiskLognorm(15,10)",{"$f":"ConvertToSimio(F14)","v":"Random.LogNormal( 2.52418781103955, .606403149831296)"},null,"D13",15]
["Discrete","Random.NegativeBinomial(ProbabilityOfSuccess, NumberOfSuccesses) ","RiskNegBin(s,p)",null,"Yes",{"$f":"_xll.RiskNegbin(5,0.5)","v":5},"=RiskNegbin(5,0.5)",{"$f":"ConvertToSimio(F15)","v":"Random.NegativeBinomial(0.5,5)"},null,"D14",5]
["Continuous","Random.Normal(mean, standard deviation)","RiskNormal(m,s)",null,"No",{"$f":"_xll.RiskNormal(0,10)","v":0},"=RiskNormal(0,10)","Random.Normal(0,10)",null,"D15",0]
["Continuous","Random.PearsonVI(shapeA, shapeB, scale)","RiskPearson6(a1,a2,b)",null,"No",{"$f":"_xll.RiskPearson6(2,5,10)","v":5},"=RiskPearson6(2,5,10)","Random.PearsonVI(2,5,10)",null,"D16",5]
["Continuous","Random.Pert(minimum, mode, maximum)","RiskPert(min,most_likely,max)",null,"No",{"$f":"_xll.RiskPert(-10,0,10)","v":0},"=RiskPert(-10,0,10)","Random.Pert(-10,0,10)",null,"D17",0]
["Discrete","Random.Poisson(mean)","RiskPoisson(l)",null,"No",{"$f":"_xll.RiskPoisson(1)","v":1},"=RiskPoisson(1)","Random.Poisson(1)",null,"D18",1]
["Continuous","Random.Triangular(minimum, mode, maximum)","RiskTriang(min,most_likely,max)",null,"No",{"$f":"_xll.RiskTriang(-10,0,10)","v":0},"=RiskTriang(-10,0,10)","Random.Triangular(-10,0,10)",null,"D19",0]
["Continuous","Random.Uniform(minimum, maximum)","RiskUniform(min,max)",null,"No",{"$f":"_xll.RiskUniform(-10,10)","v":0},"=RiskUniform(-10,10)","Random.Uniform(-10,10)",null,"D20",0]
["Continuous","Random.Weibull(shape, scale)","RiskWeibull(a,b)",null,"No",{"$f":"_xll.RiskWeibull(2,10)","v":8.8622692545275843},"=RiskWeibull(2,10)","Random.Weibull(2,10)",null,"D21",8.8622692545275843]
[]
[null,"Refer to http://www.epixanalytics.com/modelassist/AtRisk/Model_Assist.htm#Distributions/Continuous_distributions"]
[null,"Refer to Simio Reference Guide (Support Tab)"]
[]
[null,"Symbol","Refers To"]
[null,"m","Mean"]
[null,"s","Standard Deviation"]
[null,"a","Shape"]
[null,"b","Scale"]
[null,"g","Location"]
[null,"l","mean number of successes"]
[null,"p","continuous “success” probability"]
[null,"n","discrete “count” parameter"]
[null,"m","mean"]
[null,"s","the number of successes        "]

{"sheet":"Sheet2","index":3,"n_rows":21,"n_cols":4,"rows_kept":21,"cut":false,"hidden":false,"merged":[]}
[null,"Simio Value",{"$f":"\"@Risk Value\"","v":"@Risk Value"}]
["D1",0.4995,{"$f":"VLOOKUP(A2,Distributions!$J$2:$K$22,2,FALSE)","v":0.5},{"$f":"B2-C2","v":-5.0000000000000044E-4}]
["D10",-4.4135999999999997,{"$f":"VLOOKUP(A3,Distributions!$J$2:$K$22,2,FALSE)","v":-4.4116163049057722},{"$f":"B3-C3","v":-1.9836950942275777E-3}]
["D11",13.334199999999999,{"$f":"VLOOKUP(A4,Distributions!$J$2:$K$22,2,FALSE)","v":13.316774146197615},1.7425853802384594E-2]
["D12",12.149699999999999,{"$f":"VLOOKUP(A5,Distributions!$J$2:$K$22,2,FALSE)","v":12.091995761561453},5.770423843854644E-2]
["D13",14.9659,{"$f":"VLOOKUP(A6,Distributions!$J$2:$K$22,2,FALSE)","v":15},-3.4100000000000463E-2]
["D14",4.9985999999999997,{"$f":"VLOOKUP(A7,Distributions!$J$2:$K$22,2,FALSE)","v":5},-1.4000000000002899E-3]
["D15",-6.0600000000000001E-2,{"$f":"VLOOKUP(A8,Distributions!$J$2:$K$22,2,FALSE)","v":0},-6.0600000000000001E-2]
["D16",4.9812000000000003,{"$f":"VLOOKUP(A9,Distributions!$J$2:$K$22,2,FALSE)","v":5},-1.8799999999999706E-2]
["D17",-3.5999999999999999E-3,{"$f":"VLOOKUP(A10,Distributions!$J$2:$K$22,2,FALSE)","v":0},-3.5999999999999999E-3]
["D18",1.0029999999999999,{"$f":"VLOOKUP(A11,Distributions!$J$2:$K$22,2,FALSE)","v":1},2.9999999999998916E-3]
["D19",3.8999999999999998E-3,{"$f":"VLOOKUP(A12,Distributions!$J$2:$K$22,2,FALSE)","v":0},3.8999999999999998E-3]
["D2",4.9931999999999999,{"$f":"VLOOKUP(A13,Distributions!$J$2:$K$22,2,FALSE)","v":5},-6.8000000000001393E-3]
["D20",8.0000000000000002E-3,{"$f":"VLOOKUP(A14,Distributions!$J$2:$K$22,2,FALSE)","v":0},8.0000000000000002E-3]
["D21",8.8585999999999991,{"$f":"VLOOKUP(A15,Distributions!$J$2:$K$22,2,FALSE)","v":8.8622692545275843},-3.6692545275851529E-3]
["D3",-1.1000000000000001E-3,{"$f":"VLOOKUP(A16,Distributions!$J$2:$K$22,2,FALSE)","v":0},-1.1000000000000001E-3]
["D5",1E-3,{"$f":"VLOOKUP(A17,Distributions!$J$2:$K$22,2,FALSE)","v":0},1E-3]
["D6",19.979600000000001,{"$f":"VLOOKUP(A18,Distributions!$J$2:$K$22,2,FALSE)","v":20},-2.0399999999998641E-2]
["D7",10.006399999999999,{"$f":"VLOOKUP(A19,Distributions!$J$2:$K$22,2,FALSE)","v":10},6.3999999999992951E-3]
["D8",20.011600000000001,{"$f":"VLOOKUP(A20,Distributions!$J$2:$K$22,2,FALSE)","v":20},1.1600000000001387E-2]
["D9",1.0061,{"$f":"VLOOKUP(A21,Distributions!$J$2:$K$22,2,FALSE)","v":1},6.0999999999999943E-3]